Target
Coagulation factor X
Ligand
BDBM50349346
Substrate
Meas. Tech.
ChEMBL_760107 (CHEMBL1810430)
Ki
21±n/a nM
Citation
 Sielaff, FBöttcher-Friebertshäuser, EMeyer, DSaupe, SMVolk, IMGarten, WSteinmetzer, T Development of substrate analogue inhibitors for the human airway trypsin-like protease HAT. Bioorg Med Chem Lett 21:4860-4 (2011)  
Target
Name:
Coagulation factor X
Synonyms:
Activated coagulation factor X (FXa) Coagulation factor X precursor F10 Factor X heavy chain Factor Xa Stuart-Prower factor
Type:
Enzyme
Mol. Mass.:
54726.60
Organism:
Homo sapiens (Human)
Description:
Residue:
488
  
Inhibitor
Name:
BDBM50349346
Synonyms:
CHEMBL1809252
Type:
Small organic molecule
Emp. Form.:
C25H37N7O3S
Mol. Mass.:
515.671
SMILES:
[#6]-[#6](-[#6])-[#6@H](-[#7]-[#6]-c1ccc(cc1)-[#6](-[#7])=[#7])-[#6](=O)-[#6@@H](-[#6]-[#6]-[#6]\[#7]=[#6](\[#7])-[#7])-[#7]S(=O)(=O)[#6]-c1ccccc1
: