Target
Transmembrane protease serine 6
Ligand
BDBM50324475
Substrate
Meas. Tech.
ChEMBL_760111 (CHEMBL1810434)
Ki
170±n/a nM
Citation
 Sielaff, FBöttcher-Friebertshäuser, EMeyer, DSaupe, SMVolk, IMGarten, WSteinmetzer, T Development of substrate analogue inhibitors for the human airway trypsin-like protease HAT. Bioorg Med Chem Lett 21:4860-4 (2011)  
Target
Name:
Transmembrane protease serine 6
Synonyms:
Matriptase-2 TMPS6_HUMAN
Type:
PROTEIN
Mol. Mass.:
90001.12
Organism:
Homo sapiens (Human)
Description:
ChEMBL_1442547
Residue:
811
  
Inhibitor
Name:
BDBM50324475
Synonyms:
Benzylsulfonyl-D-argininyl-proline-(4-amidinobenzyl)amide Bis-(trifluoroacetate) CHEMBL1229259
Type:
Small organic molecule
Emp. Form.:
C26H36N8O4S
Mol. Mass.:
556.68
SMILES:
NC(=N)NCCC[C@@H](NS(=O)(=O)Cc1ccccc1)C(=O)N1CCC[C@H]1C(=O)NCc1ccc(cc1)C(N)=N
: