Target
Plasminogen
Ligand
BDBM50349344
Substrate
Meas. Tech.
ChEMBL_760108 (CHEMBL1810431)
Ki
3030±n/a nM
Citation
 Sielaff, FBöttcher-Friebertshäuser, EMeyer, DSaupe, SMVolk, IMGarten, WSteinmetzer, T Development of substrate analogue inhibitors for the human airway trypsin-like protease HAT. Bioorg Med Chem Lett 21:4860-4 (2011)  
Target
Name:
Plasminogen
Synonyms:
Activation peptide PLG Plasmin Plasmin heavy chain A, short form | Plasmin light chain B
Type:
Enzyme
Mol. Mass.:
90579.18
Organism:
Homo sapiens (Human)
Description:
Residue:
810
  
Inhibitor
Name:
BDBM50349344
Synonyms:
CHEMBL1809250
Type:
Small organic molecule
Emp. Form.:
C24H35N7O3S
Mol. Mass.:
501.645
SMILES:
[#6]-[#6]-[#6](-[#7]-[#6]-c1ccc(cc1)-[#6](-[#7])=[#7])-[#6](=O)-[#6@@H](-[#6]-[#6]-[#6]\[#7]=[#6](\[#7])-[#7])-[#7]S(=O)(=O)[#6]-c1ccccc1
: