Target
Dipeptidyl peptidase 9
Ligand
BDBM50336806
Substrate
Meas. Tech.
ChEMBL_760121 (CHEMBL1810498)
IC50
>60000±n/a nM
Citation
 Maezaki, HBanno, YMiyamoto, YMoritoh, YMoritou, YAsakawa, TKataoka, OTakeuchi, KSuzuki, NIkedo, KKosaka, TSasaki, MTsubotani, STani, AFunami, MYamamoto, YTawada, MAertgeerts, KYano, JOi, S Discovery of potent, selective, and orally bioavailable quinoline-based dipeptidyl peptidase IV inhibitors targeting Lys554. Bioorg Med Chem 19:4482-98 (2011)  
Target
Name:
Dipeptidyl peptidase 9
Synonyms:
DPP9 DPRP-2 Dipeptidyl peptidase 9 (DDP9) Dipeptidyl peptidase 9 (DPP9) Dipeptidyl peptidase IX Dipeptidyl peptidase-like protein 9
Type:
Enzyme
Mol. Mass.:
98260.70
Organism:
Homo sapiens (Human)
Description:
Q86TI2
Residue:
863
  
Inhibitor
Name:
BDBM50336806
Synonyms:
1-(3-(aminomethyl)-2-isobutyl-4-p-tolylquinolin-6-yl)piperazine-2,5-dione dihydrochloride | CHEMBL1672113
Type:
Small organic molecule
Emp. Form.:
C25H28N4O2
Mol. Mass.:
416.5154
SMILES:
CC(C)Cc1nc2ccc(cc2c(-c2ccc(C)cc2)c1CN)N1CC(=O)NCC1=O
: