Target
3-oxoacyl-[acyl-carrier-protein] synthase 3
Ligand
BDBM50349522
Substrate
Meas. Tech.
ChEMBL_759879 (CHEMBL1810025)
Ki
0.00000161±n/a nM
Citation
 Li, ZLLi, QSZhang, HJHu, YZhu, DDZhu, HL Design, synthesis and biological evaluation of urea derivatives from o-hydroxybenzylamines and phenylisocyanate as potential FabH inhibitors. Bioorg Med Chem 19:4413-20 (2011)  
Target
Name:
3-oxoacyl-[acyl-carrier-protein] synthase 3
Synonyms:
3-oxoacyl-[acyl-carrier-protein] synthase 3-oxoacyl-[acyl-carrier-protein] synthase III | Beta-ketoacyl-ACP synthase III (FabH)
Type:
Enzyme
Mol. Mass.:
33506.68
Organism:
Escherichia coli
Description:
C3TDZ2
Residue:
317
  
Inhibitor
Name:
BDBM50349522
Synonyms:
CHEMBL1808847
Type:
Small organic molecule
Emp. Form.:
C20H16BrFN2O2
Mol. Mass.:
415.256
SMILES:
Oc1ccc(Br)cc1CN(C(=O)Nc1ccccc1)c1ccc(F)cc1
: