Target
Furin
Ligand
BDBM50349592
Substrate
Meas. Tech.
ChEMBL_759925 (CHEMBL1810119)
Ki
102±n/a nM
Citation
 Becker, GLHardes, KSteinmetzer, T New substrate analogue furin inhibitors derived from 4-amidinobenzylamide. Bioorg Med Chem Lett 21:4695-7 (2011)  
Target
Name:
Furin
Synonyms:
FUR FURIN_HUMAN PACE | PCSK3
Type:
Enzyme Catalytic Domain
Mol. Mass.:
86676.01
Organism:
Homo sapiens (Human)
Description:
P09958
Residue:
794
  
Inhibitor
Name:
BDBM50349592
Synonyms:
CHEMBL1808921
Type:
Small organic molecule
Emp. Form.:
C33H48N12O6
Mol. Mass.:
708.811
SMILES:
[#7]\[#6](-[#7])=[#7]/[#6]-[#6]-[#6]-[#6@H](-[#7]-[#6](=O)-[#6]-c1ccccc1)-[#6](=O)-[#7]-[#6@@H](-[#6]-[#6]-[#6](-[#8])=O)-[#6](=O)-[#7]-[#6@@H](-[#6]-[#6]-[#6]\[#7]=[#6](/[#7])-[#7])-[#6](=O)-[#7]-[#6]-c1ccc(cc1)-[#6](-[#7])=[#7]
: