Target
Ketohexokinase
Ligand
BDBM50349744
Substrate
Meas. Tech.
ChEMBL_759463 (CHEMBL1810789)
IC50
87±n/a nM
Citation
 Zhang, XSong, FKuo, GHXiang, AGibbs, ACAbad, MCSun, WKuo, LCSui, Z Optimization of a pyrazole hit from FBDD into a novel series of indazoles as ketohexokinase inhibitors. Bioorg Med Chem Lett 21:4762-7 (2011)  
Target
Name:
Ketohexokinase
Synonyms:
Hepatic fructokinase KHK_HUMAN Ketohexokinase (KHK) | Ketohexokinase (KHK) Isoform C
Type:
Enzyme Catalytic Domain
Mol. Mass.:
32521.64
Organism:
Homo sapiens (Human)
Description:
Residue:
298
  
Inhibitor
Name:
BDBM50349744
Synonyms:
CHEMBL1809171 US9771375, Example 140
Type:
Small organic molecule
Emp. Form.:
C20H21N3OS
Mol. Mass.:
351.465
SMILES:
COc1ccc(cc1)-n1nc(SC)c2ccc(cc12)C1=CCNCC1
: