Target
D(2) dopamine receptor
Ligand
BDBM50349870
Substrate
Meas. Tech.
ChEMBL_760689 (CHEMBL1815674)
Ki
0.14±n/a nM
Citation
 Vangveravong, SZhang, ZTaylor, MBearden, MXu, JCui, JWang, WLuedtke, RRMach, RH Synthesis and characterization of selective dopamine D2 receptor ligands using aripiprazole as the lead compound. Bioorg Med Chem 19:3502-11 (2011)  
Target
Name:
D(2) dopamine receptor
Synonyms:
D(2) dopamine receptor DOPAMINE D2 Long DRD2 Dopamine D2 receptor Dopamine D2 receptor (D2R) Dopamine2-like | d2
Type:
Cell-surface receptors
Mol. Mass.:
50647.10
Organism:
Homo sapiens (Human)
Description:
P14416
Residue:
443
  
Inhibitor
Name:
BDBM50349870
Synonyms:
CHEMBL1813594
Type:
Small organic molecule
Emp. Form.:
C24H29N3O3
Mol. Mass.:
407.5054
SMILES:
COc1ccccc1N1CCN(CCCCOc2ccc3ccc(=O)[nH]c3c2)CC1
: