Target
Arginase-1
Ligand
BDBM50350311
Substrate
Meas. Tech.
ChEMBL_762137 (CHEMBL1816208)
Kd
1.8E1±n/a nM
Citation
 Ilies, MDi Costanzo, LDowling, DPThorn, KJChristianson, DW Binding ofa,a-disubstituted amino acids to arginase suggests new avenues for inhibitor design. J Med Chem 54:5432-43 (2011)  
Target
Name:
Arginase-1
Synonyms:
ARG1 Liver-type arginase | Type I arginase
Type:
PROTEIN
Mol. Mass.:
34737.53
Organism:
Homo sapiens (Human)
Description:
ChEMBL_978893
Residue:
322
  
Inhibitor
Name:
BDBM50350311
Synonyms:
CHEMBL1812661
Type:
Small organic molecule
Emp. Form.:
C6H14BNO4
Mol. Mass.:
174.991
SMILES:
[NH3+][C@@H](CCCCB(O)O)C([O-])=O
: