Target
Polyunsaturated fatty acid lipoxygenase ALOX12
Ligand
BDBM50350400
Substrate
Meas. Tech.
ChEMBL_761393 (CHEMBL1817023)
IC50
2000±n/a nM
Citation
 Kenyon, VRai, GJadhav, ASchultz, LArmstrong, MJameson, JBPerry, SJoshi, NBougie, JMLeister, WTaylor-Fishwick, DANadler, JLHolinstat, MSimeonov, AMaloney, DJHolman, TR Discovery of potent and selective inhibitors of human platelet-type 12- lipoxygenase. J Med Chem 54:5485-97 (2011)  
Target
Name:
Polyunsaturated fatty acid lipoxygenase ALOX12
Synonyms:
12-LOX 12LO Arachidonate 12-lipoxygenase LOG12 Platelet 12-lipoxygenase | Platelet-type lipoxygenase 12
Type:
Protein
Mol. Mass.:
75689.18
Organism:
Homo sapiens (Human)
Description:
P18054
Residue:
663
  
Inhibitor
Name:
BDBM50350400
Synonyms:
CHEMBL1561166
Type:
Small organic molecule
Emp. Form.:
C17H15BrN2O3
Mol. Mass.:
375.217
SMILES:
CCC(=O)NC(c1ccco1)c1cc(Br)c2cccnc2c1O
: