Target
Carbonic anhydrase
Ligand
BDBM10880
Substrate
Meas. Tech.
ChEMBL_762739 (CHEMBL1815990)
pH
8.3±n/a
Ki
104±n/a nM
Comments
extracted
Citation
 Nishimori, IMinakuchi, TVullo, DScozzafava, ASupuran, CT Inhibition studies of theß-carbonic anhydrases from the bacterial pathogen Salmonella enterica serovar Typhimurium with sulfonamides and sulfamates. Bioorg Med Chem 19:5023-30 (2011)  
Target
Name:
Carbonic anhydrase
Synonyms:
PROBABLE TRANSMEMBRANE CARBONIC ANHYDRASE (CARBONATE DEHYDRATASE) (CARBONIC DEHYDRATASE)
Type:
PROTEIN
Mol. Mass.:
80567.22
Organism:
Mycobacterium tuberculosis
Description:
ChEMBL_878775
Residue:
764
  
Inhibitor
Name:
BDBM10880
Synonyms:
AZA AZM acetazolamide Acetazolamide Acetazolamide (AZA) Acetazolamide, 5 Acetazolamide, AZA CHEMBL20 Sulfonamide, 1 US11278534, Example acetazolamide sulfonamide 1
Type:
Small organic molecule
Emp. Form.:
C4H6N4O3S2
Mol. Mass.:
222.245
SMILES:
CC(=O)Nc1nnc(s1)S(N)(=O)=O
: