Target
Vasopressin V2 receptor
Ligand
BDBM50350866
Substrate
Meas. Tech.
ChEMBL_763492 (CHEMBL1819841)
EC50
1.4±n/a nM
Citation
 Wisniewski, KGalyean, RTariga, HAlagarsamy, SCroston, GHeitzmann, JKohan, AWisniewska, HLaporte, RRivière, PJSchteingart, CD New, potent, selective, and short-acting peptidic V1a receptor agonists. J Med Chem 54:4388-98 (2011)  
Target
Name:
Vasopressin V2 receptor
Synonyms:
ADHR AVPR2 DIR Renal-type arginine vasopressin receptor V2R_HUMAN Vasopressin V2 receptor | Vasopressin receptor
Type:
Receptor
Mol. Mass.:
40295.28
Organism:
Homo sapiens (Human)
Description:
P30518
Residue:
371
  
Inhibitor
Name:
BDBM50350866
Synonyms:
CHEMBL1819441
Type:
Small organic molecule
Emp. Form.:
C46H65N15O11S2
Mol. Mass.:
1068.232
SMILES:
[#7]-[#6@H]-1-[#6]-[#16]-[#16]-[#6]-[#6@H](-[#7]-[#6](=O)-[#6@H](-[#6]-[#6](-[#7])=O)-[#7]-[#6](=O)-[#6@H](-[#6]-[#6]-[#6](-[#7])=O)-[#7]-[#6](=O)-[#6@H](-[#6]-c2ccccc2)-[#7]-[#6](=O)-[#6@H](-[#6]-c2ccccc2)-[#7]-[#6]-1=O)-[#6](=O)-[#7]-1-[#6]-[#6]-[#6]-[#6@H]-1-[#6](=O)-[#7]-[#6@@H](-[#6]-[#6]-[#6]\[#7]=[#6](\[#7])-[#7])-[#6](=O)-[#7]-[#6]-[#6](-[#7])=O
: