Target
Sortase family protein
Ligand
BDBM50351172
Substrate
Meas. Tech.
ChEMBL_764159 (CHEMBL1821370)
IC50
116000±n/a nM
Citation
 Bae, JJeon, JELee, YJLee, HSSim, CJOh, KBShin, J Sesterterpenes from the tropical sponge Coscinoderma sp. J Nat Prod 74:1805-11 (2011)  
Target
Name:
Sortase family protein
Synonyms:
Sortase | Sortase A (SrtA)
Type:
Enzyme
Mol. Mass.:
23546.15
Organism:
Staphylococcus aureus
Description:
Residue:
206
  
Inhibitor
Name:
BDBM50351172
Synonyms:
CHEMBL78771
Type:
Small organic molecule
Emp. Form.:
C7H6HgO3
Mol. Mass.:
338.71
SMILES:
O[Hg]c1ccc(cc1)C(O)=O
: