Target
Bifunctional epoxide hydrolase 2
Ligand
BDBM50351246
Substrate
Meas. Tech.
ChEMBL_763895 (CHEMBL1819920)
IC50
0.4±n/a nM
Citation
 Brown, JRNorth, EJHurdle, JGMorisseau, CScarborough, JSSun, DKorduláková, JScherman, MSJones, VGrzegorzewicz, ACrew, RMJackson, MMcNeil, MRLee, RE The structure-activity relationship of urea derivatives as anti-tuberculosis agents. Bioorg Med Chem 19:5585-95 (2011)  
Target
Name:
Bifunctional epoxide hydrolase 2
Synonyms:
Cytosolic epoxide hydrolase 2 EPHX2 HYES_HUMAN Soluble epoxide hydrolase (sEH) | epoxide hydrolase 2, cytoplasmic
Type:
Enzyme
Mol. Mass.:
62613.07
Organism:
Homo sapiens (Human)
Description:
P34913
Residue:
555
  
Inhibitor
Name:
BDBM50351246
Synonyms:
CHEMBL1818386
Type:
Small organic molecule
Emp. Form.:
C18H21F3N2O
Mol. Mass.:
338.3673
SMILES:
Fc1ccc(NC(=O)NCC23CC4CC(CC(C4)C2)C3)c(F)c1F
: