Target
Solute carrier family 5 member 4
Ligand
BDBM50351443
Substrate
Meas. Tech.
ChEMBL_764617 (CHEMBL1821169)
IC50
120±n/a nM
Citation
 Ohtake, YSato, TMatsuoka, HNishimoto, MTaka, NTakano, KYamamoto, KOhmori, MHiguchi, TMurakata, MKobayashi, TMorikawa, KShimma, NSuzuki, MHagita, HOzawa, KYamaguchi, KKato, MIkeda, S 5a-Carba-ß-D-glucopyranose derivatives as novel sodium-dependent glucose cotransporter 2 (SGLT2) inhibitors for the treatment of type 2 diabetes. Bioorg Med Chem 19:5334-41 (2011)  
Target
Name:
Solute carrier family 5 member 4
Synonyms:
Low affinity sodium-glucose cotransporter SAAT1 SGLT3 Sodium/glucose cotransporter 3 | Solute carrier family 5 member 4
Type:
PROTEIN
Mol. Mass.:
72452.26
Organism:
Homo sapiens (Human)
Description:
ChEMBL_764617
Residue:
659
  
Inhibitor
Name:
BDBM50351443
Synonyms:
CHEMBL1819496
Type:
Small organic molecule
Emp. Form.:
C21H23F3O5
Mol. Mass.:
412.3995
SMILES:
OC[C@H]1C[C@@H](Oc2ccccc2Cc2ccc(cc2)C(F)(F)F)[C@H](O)[C@@H](O)[C@@H]1O
: