Target
Prostacyclin receptor
Ligand
BDBM50152515
Substrate
Meas. Tech.
ChEMBL_764674 (CHEMBL1821226)
Ki
37±n/a nM
Citation
 Iwahashi, MTakahashi, ETanaka, MMatsunaga, YOkada, YMatsumoto, RNambu, FNakai, HToda, M Design and synthesis of new prostaglandin D2 receptor antagonists. Bioorg Med Chem 19:5361-71 (2011)  
Target
Name:
Prostacyclin receptor
Synonyms:
PGI receptor PRIPR Prostacyclin (IP) Receptor Prostaglandin I Prostaglandin I2 receptor | Prostanoid IP receptor
Type:
G Protein-Coupled Receptor (GPCR)
Mol. Mass.:
40968.22
Organism:
Homo sapiens (Human)
Description:
The membranes prepared from human platelet were used in binding assay.
Residue:
386
  
Inhibitor
Name:
BDBM50152515
Synonyms:
CHEMBL364841 | {2-Methyl-1-[4-(4-methyl-3,4-dihydro-2H-benzo[1,4]oxazin-2-ylmethoxy)-benzoyl]-1H-indol-4-yl}-acetic acid
Type:
Small organic molecule
Emp. Form.:
C28H26N2O5
Mol. Mass.:
470.5164
SMILES:
CN1C[C@@H](COc2ccc(cc2)C(=O)n2c(C)cc3c(CC(O)=O)cccc23)Oc2ccccc12
: