Target
Transcriptional activator protein LasR
Ligand
BDBM50351508
Substrate
Meas. Tech.
ChEMBL_765283 (CHEMBL1827922)
IC50
1750±n/a nM
Citation
 Lowery, CASalzameda, NTSawada, DKaufmann, GFJanda, KD Medicinal chemistry as a conduit for the modulation of quorum sensing. J Med Chem 53:7467-89 (2010)  
Target
Name:
Transcriptional activator protein LasR
Synonyms:
LASR_PSEAE | lasR
Type:
PROTEIN
Mol. Mass.:
26618.24
Organism:
Pseudomonas aeruginosa
Description:
ChEMBL_1475312
Residue:
239
  
Inhibitor
Name:
BDBM50351508
Synonyms:
CHEMBL259352
Type:
Small organic molecule
Emp. Form.:
C12H21NO3
Mol. Mass.:
227.3
SMILES:
CCCCCCCC(=O)N[C@H]1CCOC1=O
: