Target
Sterol regulatory element-binding protein 2
Ligand
BDBM20182
Substrate
Meas. Tech.
ChEMBL_765688 (CHEMBL1827133)
IC50
300±n/a nM
Citation
 Kamisuki, SShirakawa, TKugimiya, AAbu-Elheiga, LChoo, HYYamada, KShimogawa, HWakil, SJUesugi, M Synthesis and evaluation of diarylthiazole derivatives that inhibit activation of sterol regulatory element-binding proteins. J Med Chem 54:4923-7 (2011)  
Target
Name:
Sterol regulatory element-binding protein 2
Synonyms:
BHLHD2 SREBF2 | SREBP2
Type:
PROTEIN
Mol. Mass.:
123713.87
Organism:
Homo sapiens (Human)
Description:
ChEMBL_765690
Residue:
1141
  
Inhibitor
Name:
BDBM20182
Synonyms:
(1S,2R,5S,10S,11S,14R,15R)-14-[(2R)-6-hydroxy-6-methylheptan-2-yl]-2,15-dimethyltetracyclo[8.7.0.0^{2,7}.0^{11,15}]heptadec-7-en-5-ol 25-hydroxycholesterol
Type:
Small organic molecule
Emp. Form.:
C27H46O2
Mol. Mass.:
402.6529
SMILES:
[H][C@@]1(CC[C@@]2([H])[C@]3([H])CC=C4C[C@@]([H])(O)CC[C@]4(C)[C@@]3([H])CC[C@]12C)[C@H](C)CCCC(C)(C)O
: