Target
Beta-secretase 1
Ligand
BDBM14322
Substrate
Meas. Tech.
ChEMBL_765826 (CHEMBL1827651)
Kd
900000±n/a nM
Citation
 Cheng, YJudd, TCBartberger, MDBrown, JChen, KFremeau, RTHickman, DHitchcock, SAJordan, BLi, VLopez, PLouie, SWLuo, YMichelsen, KNixey, TPowers, TSRattan, CSickmier, EASt Jean, DJWahl, RCWen, PHWood, S From fragment screening to in vivo efficacy: optimization of a series of 2-aminoquinolines as potent inhibitors of beta-site amyloid precursor protein cleaving enzyme 1 (BACE1). J Med Chem 54:5836-57 (2011)  
Target
Name:
Beta-secretase 1
Synonyms:
ASP2 Aspartyl protease 2 BACE1 Beta-secretase (BACE) Beta-secretase 1 (BACE 1) Beta-secretase 1 (BACE1) Beta-site amyloid precursor protein cleaving enzyme 1 Memapsin-2 beta-Secretase (BACE-1) | beta-Secretase (BACE1)
Type:
Protein
Mol. Mass.:
55755.10
Organism:
Homo sapiens (Human)
Description:
P56817
Residue:
501
  
Inhibitor
Name:
BDBM14322
Synonyms:
2-Aminoquinoline 1 CHEMBL61236 Quinolin-2-amine | fragment 2 (J. med. chem.,50,1116)
Type:
Small organic molecule
Emp. Form.:
C9H8N2
Mol. Mass.:
144.1732
SMILES:
Nc1ccc2ccccc2n1
: