Target
Sodium-dependent serotonin transporter
Ligand
BDBM50352729
Substrate
Meas. Tech.
ChEMBL_766795 (CHEMBL1827735)
IC50
6±n/a nM
Citation
 Seo, HJPark, EJKim, MJKang, SYLee, SHKim, HJLee, KNJung, MELee, MKim, MSSon, EJPark, WKKim, JLee, J Design and synthesis of novel arylpiperazine derivatives containing the imidazole core targeting 5-HT(2A) receptor and 5-HT transporter. J Med Chem 54:6305-18 (2011)  
Target
Name:
Sodium-dependent serotonin transporter
Synonyms:
5-HT Transporter 5HTT SC6A4_HUMAN SLC6A4 Serotonin transporter (5HTT) Sodium-dependent serotonin transporter (SERT) | Solute carrier family 6 member 4
Type:
Multi-pass membrane protein
Mol. Mass.:
70322.51
Organism:
Homo sapiens (Human)
Description:
P31645
Residue:
630
  
Inhibitor
Name:
BDBM50352729
Synonyms:
CHEMBL1823056
Type:
Small organic molecule
Emp. Form.:
C27H35N5O
Mol. Mass.:
445.5997
SMILES:
Cc1nc(C(=O)NCCCN2CCN(CC2)c2cccc(C)c2C)c(C)n1-c1ccccc1
: