Target
Sodium-dependent serotonin transporter
Ligand
BDBM50313284
Substrate
Meas. Tech.
ChEMBL_766791 (CHEMBL1827731)
Ki
21±n/a nM
Citation
 Seo, HJPark, EJKim, MJKang, SYLee, SHKim, HJLee, KNJung, MELee, MKim, MSSon, EJPark, WKKim, JLee, J Design and synthesis of novel arylpiperazine derivatives containing the imidazole core targeting 5-HT(2A) receptor and 5-HT transporter. J Med Chem 54:6305-18 (2011)  
Target
Name:
Sodium-dependent serotonin transporter
Synonyms:
5-HT Transporter 5HTT SC6A4_HUMAN SLC6A4 Serotonin transporter (5HTT) Sodium-dependent serotonin transporter (SERT) | Solute carrier family 6 member 4
Type:
Multi-pass membrane protein
Mol. Mass.:
70322.51
Organism:
Homo sapiens (Human)
Description:
P31645
Residue:
630
  
Inhibitor
Name:
BDBM50313284
Synonyms:
(S)-2-((7-fluoro-2,3-dihydro-1H-inden-4-yloxy)methyl)morpholine CHEMBL1822892 | YM-35992
Type:
Small organic molecule
Emp. Form.:
C14H18FNO2
Mol. Mass.:
251.2966
SMILES:
Fc1ccc(OC[C@@H]2CNCCO2)c2CCCc12
: