Target
ALK tyrosine kinase receptor/Nucleophosmin
Ligand
BDBM50353045
Substrate
Meas. Tech.
ChEMBL_767867 (CHEMBL1825979)
IC50
200±n/a nM
Citation
 Ott, GRWells, GJThieu, TVQuail, MRLisko, JGMesaros, EFGingrich, DEGhose, AKWan, WLu, LCheng, MAlbom, MSAngeles, TSHuang, ZAimone, LDAtor, MARuggeri, BADorsey, BD 2,7-disubstituted-pyrrolo[2,1-f][1,2,4]triazines: new variant of an old template and application to the discovery of anaplastic lymphoma kinase (ALK) inhibitors with in vivo antitumor activity. J Med Chem 54:6328-41 (2011)  
Target
Name:
ALK tyrosine kinase receptor/Nucleophosmin
Synonyms:
NPM/ALK (Nucleophosmin/ALK tyrosine kinase receptor)
Type:
Mol. Mass.:
Description:
ASSAY_ID of EBI is 331455
Components:
This complex has 2 components.
Component 1
Name:
ALK tyrosine kinase receptor
Synonyms:
ALK ALK_HUMAN CD_antigen: CD246
Type:
Protein
Mol. Mass.:
176453.10
Organism:
Homo sapiens (Human)
Description:
Q9UM73
Residue:
1620
  
Component 2
Name:
Nucleophosmin
Synonyms:
NPM NPM1 | NPM_HUMAN
Type:
PROTEIN
Mol. Mass.:
32552.99
Organism:
Homo sapiens (Human)
Description:
ChEMBL_1502715
Residue:
294
  
Component 3
Name:
ALK tyrosine kinase receptor
Synonyms:
ALK ALK_HUMAN CD_antigen: CD246
Type:
Protein
Mol. Mass.:
176453.10
Organism:
Homo sapiens (Human)
Description:
Q9UM73
Residue:
1620
  
Inhibitor
Name:
BDBM50353045
Synonyms:
CHEMBL1822524
Type:
Small organic molecule
Emp. Form.:
C26H31N7O3S
Mol. Mass.:
521.634
SMILES:
COc1cc(ccc1Nc1ncc2ccc(-c3ccccc3N(C)S(C)(=O)=O)n2n1)N1CCN(C)CC1
: