Target
Histone-lysine N-methyltransferase EHMT2
Ligand
BDBM50323809
Substrate
Meas. Tech.
ChEMBL_768494 (CHEMBL1832317)
IC50
25±n/a nM
Citation
 Liu, FBarsyte-Lovejoy, DAllali-Hassani, AHe, YHerold, JMChen, XYates, CMFrye, SVBrown, PJHuang, JVedadi, MArrowsmith, CHJin, J Optimization of cellular activity of G9a inhibitors 7-aminoalkoxy-quinazolines. J Med Chem 54:6139-50 (2011)  
Target
Name:
Histone-lysine N-methyltransferase EHMT2
Synonyms:
BAT8 EHMT2 G9A Histone-lysine N-methyltransferase EHMT1/EHMT2 KMT1C Protein G9a (G9a)
Type:
Enzyme
Mol. Mass.:
132339.87
Organism:
Homo sapiens (Human)
Description:
Q96KQ7
Residue:
1210
  
Inhibitor
Name:
BDBM50323809
Synonyms:
6-Methoxy-2-(4-methyl-1,4-diazepan-1-yl)-N-(1-methylpiperidin-4-yl)-7-(3-(piperidin-1-yl)propoxy)quinazolin-4-amine | CHEMBL1213957
Type:
Small organic molecule
Emp. Form.:
C29H47N7O2
Mol. Mass.:
525.7292
SMILES:
COc1cc2c(NC3CCN(C)CC3)nc(nc2cc1OCCCN1CCCCC1)N1CCCN(C)CC1
: