Target
Histone deacetylase 5
Ligand
BDBM50353233
Substrate
Meas. Tech.
ChEMBL_769061 (CHEMBL1832524)
Ki
3.1±n/a nM
Citation
 Wang, HYu, NChen, DLee, KCLye, PLChang, JWDeng, WNg, MCLu, TKhoo, MLPoulsen, ASangthongpitag, KWu, XHu, CGoh, KCWang, XFang, LGoh, KLKhng, HHGoh, SKYeo, PLiu, XBonday, ZWood, JMDymock, BWKantharaj, ESun, ET Discovery of (2E)-3-{2-butyl-1-[2-(diethylamino)ethyl]-1H-benzimidazol-5-yl}-N-hydroxyacrylamide (SB939), an orally active histone deacetylase inhibitor with a superior preclinical profile. J Med Chem 54:4694-720 (2011)  
Target
Name:
Histone deacetylase 5
Synonyms:
Antigen NY-CO-9 HDAC5 Histone acetylase 5 (HDAC5) Human HDAC5 | KIAA0600
Type:
Enzyme
Mol. Mass.:
121968.61
Organism:
Homo sapiens (Human)
Description:
Q9UQL6
Residue:
1122
  
Inhibitor
Name:
BDBM50353233
Synonyms:
CHEMBL1830536
Type:
Small organic molecule
Emp. Form.:
C20H28N4O2
Mol. Mass.:
356.4619
SMILES:
CCNCCn1c(CC\C=C/CC)nc2cc(\C=C\C(=O)NO)ccc12
: