Target
ATP-dependent translocase ABCB1
Ligand
BDBM50353604
Substrate
Meas. Tech.
ChEMBL_769544 (CHEMBL1833291)
Ki
570±n/a nM
Citation
 Perestelo, NRSánchez-Cañete, MPGamarro, FJiménez, IACastanys, SBazzocchi, IL Overcoming human P-glycoprotein-dependent multidrug resistance with novel dihydro-ß-agarofuran sesquiterpenes. Eur J Med Chem 46:4915-23 (2011)  
Target
Name:
ATP-dependent translocase ABCB1
Synonyms:
ABCB1 MDR1_HUMAN Multidrug resistance protein 1 P-glycoprotein (P-gp) PGY1
Type:
Protein
Mol. Mass.:
141503.50
Organism:
Homo sapiens (Human)
Description:
P08183
Residue:
1280
  
Inhibitor
Name:
BDBM50353604
Synonyms:
CHEMBL1829527
Type:
Small organic molecule
Emp. Form.:
C31H36O9
Mol. Mass.:
552.6121
SMILES:
CC(=O)O[C@@H]1C[C@](C)(O)[C@@]23C[C@@H](C[C@H](OC(=O)\C=C\c4ccccc4)[C@]2(C)[C@H]1OC(=O)c1ccoc1)C(C)(C)O3
: