Target
Mu-type opioid receptor
Ligand
BDBM50326673
Substrate
Meas. Tech.
ChEMBL_770074 (CHEMBL1832554)
IC50
0.6341±n/a nM
Citation
 Malinka, WRedzicka, AJastrzebska-Wiesek, MFilipek, BDybala, MKarczmarzyk, ZUrbanczyk-Lipkowska, ZKalicki, P Derivatives of pyrrolo[3,4-d]pyridazinone, a new class of analgesic agents. Eur J Med Chem 46:4992-9 (2011)  
Target
Name:
Mu-type opioid receptor
Synonyms:
MOR-1 Mu-type opioid receptor (MOR) OPRM_RAT Opioid receptor B Ror-b
Type:
G Protein-Coupled Receptor (GPCR)
Mol. Mass.:
44503.11
Organism:
Rattus norvegicus (rat)
Description:
Competition binding assays were carried out using membrane preparations from transfected HN9.10 cells that constitutively expressed the mu opioid receptor.
Residue:
398
  
Inhibitor
Name:
BDBM50326673
Synonyms:
(levallorphan)17-allyl-(1R,9R)-17-azatetracyclo[7.5.3.01,10.02,7]heptadeca-2(7),3,5-trien-4-ol 17-allyl-17-azatetracyclo[7.5.3.01,10.02,7]heptadeca-2(7),3,5-trien-4-ol (Levallorphan) LEVALLORPHAN Naloxiphan
Type:
Small organic molecule
Emp. Form.:
C19H25NO
Mol. Mass.:
283.4079
SMILES:
Oc1ccc2C[C@@H]3[C@@H]4CCCC[C@]4(CCN3CC=C)c2c1
: