Target
Amine oxidase [flavin-containing] B
Ligand
BDBM50353722
Substrate
Meas. Tech.
ChEMBL_769479 (CHEMBL1833115)
IC50
8620±n/a nM
Citation
 Secci, DCarradori, SBolasco, AChimenti, PYáñez, MOrtuso, FAlcaro, S Synthesis and selective human monoamine oxidase inhibition of 3-carbonyl, 3-acyl, and 3-carboxyhydrazido coumarin derivatives. Eur J Med Chem 46:4846-52 (2011)  
Target
Name:
Amine oxidase [flavin-containing] B
Synonyms:
AOFB_HUMAN MAOB Monoamine oxidase type B (MAO B) Monoamine oxidase type B (MAOB)
Type:
Protein
Mol. Mass.:
58768.76
Organism:
Homo sapiens (Human)
Description:
P27338
Residue:
520
  
Inhibitor
Name:
BDBM50353722
Synonyms:
CHEMBL1830828
Type:
Small organic molecule
Emp. Form.:
C17H18O5
Mol. Mass.:
302.3218
SMILES:
OC(=O)c1cc2ccc(OC3CCCCCC3)cc2oc1=O
: