Target
Amine oxidase [flavin-containing] B
Ligand
BDBM50353731
Substrate
Meas. Tech.
ChEMBL_769479 (CHEMBL1833115)
IC50
21630±n/a nM
Citation
 Secci, DCarradori, SBolasco, AChimenti, PYáñez, MOrtuso, FAlcaro, S Synthesis and selective human monoamine oxidase inhibition of 3-carbonyl, 3-acyl, and 3-carboxyhydrazido coumarin derivatives. Eur J Med Chem 46:4846-52 (2011)  
Target
Name:
Amine oxidase [flavin-containing] B
Synonyms:
AOFB_HUMAN MAOB Monoamine oxidase type B (MAO B) Monoamine oxidase type B (MAOB)
Type:
Protein
Mol. Mass.:
58768.76
Organism:
Homo sapiens (Human)
Description:
P27338
Residue:
520
  
Inhibitor
Name:
BDBM50353731
Synonyms:
CHEMBL1830810
Type:
Small organic molecule
Emp. Form.:
C13H12O5
Mol. Mass.:
248.2314
SMILES:
CCOC(=O)c1cc2cc(OC)ccc2oc1=O
: