Target
Amine oxidase [flavin-containing] A
Ligand
BDBM50353727
Substrate
Meas. Tech.
ChEMBL_769477 (CHEMBL1831417)
IC50
40550±n/a nM
Citation
 Secci, DCarradori, SBolasco, AChimenti, PYáñez, MOrtuso, FAlcaro, S Synthesis and selective human monoamine oxidase inhibition of 3-carbonyl, 3-acyl, and 3-carboxyhydrazido coumarin derivatives. Eur J Med Chem 46:4846-52 (2011)  
Target
Name:
Amine oxidase [flavin-containing] A
Synonyms:
AOFA_HUMAN MAO-A Monoamine oxidase Monoamine oxidase type A (MAO A) Monoamine oxidase type A (MAOA)
Type:
Protein
Mol. Mass.:
59689.53
Organism:
Homo sapiens (Human)
Description:
P21397
Residue:
527
  
Inhibitor
Name:
BDBM50353727
Synonyms:
CHEMBL1830808
Type:
Small organic molecule
Emp. Form.:
C12H10O5
Mol. Mass.:
234.2048
SMILES:
CCOC(=O)c1cc2cccc(O)c2oc1=O
: