Target
D-amino-acid oxidase
Ligand
BDBM50260725
Substrate
Meas. Tech.
ChEMBL_769923 (CHEMBL1832107)
Kd
19±n/a nM
Citation
 Lange, JHVenhorst, Jvan Dongen, MJFrankena, JBassissi, Fde Bruin, NMden Besten, Cde Beer, SBOostenbrink, CMarkova, NKruse, CG Biophysical and physicochemical methods differentiate highly ligand-efficient human D-amino acid oxidase inhibitors. Eur J Med Chem 46:4808-19 (2011)  
Target
Name:
D-amino-acid oxidase
Synonyms:
D-amino-acid oxidase (DAAO) DAMOX OXDA_HUMAN
Type:
Homodimer
Mol. Mass.:
39476.06
Organism:
Homo sapiens (Human)
Description:
P14920
Residue:
347
  
Inhibitor
Name:
BDBM50260725
Synonyms:
4H-thieno[3,2-b]pyrrole-5-carboxylic acid | CHEMBL507614
Type:
Small organic molecule
Emp. Form.:
C7H5NO2S
Mol. Mass.:
167.185
SMILES:
OC(=O)c1cc2sccc2[nH]1
: