Target
Sodium/glucose cotransporter 2
Ligand
BDBM50353876
Substrate
Meas. Tech.
ChEMBL_769664 (CHEMBL1831435)
IC50
57.2±n/a nM
Citation
 Lee, SHSong, KSKim, JYKang, MLee, JSCho, SHPark, HJKim, JLee, J Novel thiophenyl C-aryl glucoside SGLT2 inhibitors as potential antidiabetic agents. Bioorg Med Chem 19:5813-32 (2011)  
Target
Name:
Sodium/glucose cotransporter 2
Synonyms:
Na(+)/glucose cotransporter 2 SGLT2 Sodium-Dependent Glucose Cotransporter 2 (SGLT2) Solute carrier family 5 member 2
Type:
Protein
Mol. Mass.:
72902.00
Organism:
Homo sapiens (Human)
Description:
P31639
Residue:
672
  
Inhibitor
Name:
BDBM50353876
Synonyms:
CHEMBL1830350 | US9006187, 11
Type:
Small organic molecule
Emp. Form.:
C22H27ClO6S
Mol. Mass.:
454.964
SMILES:
OC[C@H]1O[C@H]([C@H](O)[C@@H](O)[C@@H]1O)c1cc(Cc2ccc(OC3CCCC3)cc2)c(Cl)s1
: