Target
Histone deacetylase 9
Ligand
BDBM50354086
Substrate
Meas. Tech.
ChEMBL_770955 (CHEMBL1838194)
IC50
>50000±n/a nM
Citation
 Wang, CHenkes, LMDoughty, LBHe, MWang, DMeyer-Almes, FJCheng, YQ Thailandepsins: bacterial products with potent histone deacetylase inhibitory activities and broad-spectrum antiproliferative activities. J Nat Prod 74:2031-8 (2011)  
Target
Name:
Histone deacetylase 9
Synonyms:
HD9 HDAC7B HDAC9_HUMAN Histone acetylase 9 (HDAC9) Histone deacetylase 9 (HDAC9) Human HDAC9 MITR
Type:
Enzyme
Mol. Mass.:
111304.31
Organism:
Homo sapiens (Human)
Description:
Q9UKV0
Residue:
1011
  
Inhibitor
Name:
BDBM50354086
Synonyms:
FK-228 ROMIDEPSIN
Type:
Small organic molecule
Emp. Form.:
C25H39N3O6S2
Mol. Mass.:
541.724
SMILES:
C\C=C1/NC(=O)[C@@H](CS)NC(=O)[C@H](CC(=O)C[C@H](OC(=O)[C@@H](NC1=O)C(C)C)\C=C\CCS)C(C)C
: