Target
Histone deacetylase 3/Nuclear receptor corepressor 2 (HDAC3/NCoR2)
Ligand
BDBM50354084
Substrate
Meas. Tech.
ChEMBL_770950 (CHEMBL1838189)
IC50
23±n/a nM
Citation
 Wang, CHenkes, LMDoughty, LBHe, MWang, DMeyer-Almes, FJCheng, YQ Thailandepsins: bacterial products with potent histone deacetylase inhibitory activities and broad-spectrum antiproliferative activities. J Nat Prod 74:2031-8 (2011)  
Target
Name:
Histone deacetylase 3/Nuclear receptor corepressor 2 (HDAC3/NCoR2)
Synonyms:
HDAC3/NcoR2 Complex | Histone deacetylase 3/Nuclear receptor corepressor 2
Type:
Mol. Mass.:
Description:
ASSAY_ID of ChEMBL is 2146499
Components:
This complex has 2 components.
Component 1
Name:
Histone deacetylase 3
Synonyms:
HD3 HDAC3_HUMAN Human HDAC3 SMAP45
Type:
Enzyme
Mol. Mass.:
48829.55
Organism:
Homo sapiens (Human)
Description:
O15379
Residue:
428
  
Component 2
Name:
Nuclear receptor corepressor 2
Synonyms:
CTG repeat protein 26 Histone deacetylase 2/Nuclear receptor corepressor 2 NCOR2 Nuclear receptor corepressor 2 SMAP270 Silencing mediator of retinoic acid and thyroid hormone receptor TRAC | Thyroid-, retinoic-acid-receptor-associated corepressor
Type:
Enzyme
Mol. Mass.:
274839.59
Organism:
Homo sapiens (Human)
Description:
Q9Y618
Residue:
2514
  
Inhibitor
Name:
BDBM50354084
Synonyms:
CHEMBL1836145
Type:
Small organic molecule
Emp. Form.:
C24H39N3O6S2
Mol. Mass.:
529.713
SMILES:
CCCC[C@H]1NC(=O)C[C@@H]2OC(=O)C[C@H](O)[C@H](NC(=O)[C@@H](CSSCC\C=C\2)NC1=O)[C@@H](C)CC
: