Target
Sphingosine 1-phosphate receptor 2
Ligand
BDBM23165
Substrate
Meas. Tech.
ChEMBL_770833 (CHEMBL1837638)
EC50
>31622.78±n/a nM
Citation
 Demont, EHArpino, SBit, RACampbell, CADeeks, NDesai, SDowell, SJGaskin, PGray, JRHarrison, LAHaynes, AHeightman, TDHolmes, DSHumphreys, PGKumar, UMorse, MAOsborne, GJPanchal, TPhilpott, KLTaylor, SWatson, RWillis, RWitherington, J Discovery of a brain-penetrant S1P3-sparing direct agonist of the S1P¿? and S1P5 receptors efficacious at low oral dose. J Med Chem 54:6724-33 (2011)  
Target
Name:
Sphingosine 1-phosphate receptor 2
Synonyms:
EDG5 S1PR2 Sphingosine 1-phosphate receptor Sphingosine-1-phosphate receptor 2 | ndothelial differentiation G-protein coupled receptor 5
Type:
G Protein-Coupled Receptor (GPCR)
Mol. Mass.:
38883.16
Organism:
Homo sapiens (Human)
Description:
Membranes isolated from S1P2-transfected CHO cells were used in ligand binding assay.
Residue:
353
  
Inhibitor
Name:
BDBM23165
Synonyms:
CHEMBL366208 [(2S)-2-amino-3-hydroxy-2-[2-(4-octylphenyl)ethyl]propoxy]phosphonic acid
Type:
Small organic molecule
Emp. Form.:
C19H34NO5P
Mol. Mass.:
387.4507
SMILES:
CCCCCCCCc1ccc(CC[C@](N)(CO)COP(O)(O)=O)cc1
: