Target
Carbonic anhydrase 2
Ligand
BDBM50354346
Substrate
Meas. Tech.
ChEMBL_770796 (CHEMBL1837601)
Ki
11.2±n/a nM
Citation
 Morris, JCChiche, JGrellier, CLopez, MBornaghi, LFMaresca, ASupuran, CTPouysségur, JPoulsen, SA Targeting hypoxic tumor cell viability with carbohydrate-based carbonic anhydrase IX and XII inhibitors. J Med Chem 54:6905-18 (2011)  
Target
Name:
Carbonic anhydrase 2
Synonyms:
CA-II CAC Carbonate dehydratase II Carbonic anhydrase 2 (CA-II) Carbonic anhydrase C Carbonic anhydrase II (CA-II) Carbonic anhydrase II (hCA II) | Carbonic anhydrase isoenzyme II (hCA II)
Type:
Enzyme
Mol. Mass.:
29250.71
Organism:
Homo sapiens (Human)
Description:
P00918
Residue:
260
  
Inhibitor
Name:
BDBM50354346
Synonyms:
CHEMBL1836623
Type:
Small organic molecule
Emp. Form.:
C23H27IN4O11S2
Mol. Mass.:
726.515
SMILES:
CC(=O)OC[C@H]1O[C@@H](SCc2nnn(c2I)-c2ccc(cc2)S(N)(=O)=O)[C@H](OC(C)=O)[C@@H](OC(C)=O)[C@H]1OC(C)=O
: