Target
Carbonic anhydrase 12
Ligand
BDBM50278783
Substrate
Meas. Tech.
ChEMBL_770798 (CHEMBL1837603)
Ki
10.9±n/a nM
Citation
 Morris, JCChiche, JGrellier, CLopez, MBornaghi, LFMaresca, ASupuran, CTPouysségur, JPoulsen, SA Targeting hypoxic tumor cell viability with carbohydrate-based carbonic anhydrase IX and XII inhibitors. J Med Chem 54:6905-18 (2011)  
Target
Name:
Carbonic anhydrase 12
Synonyms:
CA-XII CAH12_HUMAN Carbonic anhydrase Carbonic anhydrase XII Carbonic anhydrase XII (CAXII) | Tumor antigen HOM-RCC-3.1.3
Type:
Enzyme
Mol. Mass.:
39456.00
Organism:
Homo sapiens (Human)
Description:
Catalytic domain of human cloned isozyme was used in the assay
Residue:
354
  
Inhibitor
Name:
BDBM50278783
Synonyms:
4-(4-{[2',3',4',6'-Tetra-O-acetyl-beta-D-galactopyranosyl]sulfonylmethyl}-1-H-1,2,3-triazol-1-yl)benzenesulfonamide | CHEMBL499111
Type:
Small organic molecule
Emp. Form.:
C23H28N4O13S2
Mol. Mass.:
632.617
SMILES:
CC(=O)OC[C@H]1O[C@H]([C@H](OC(C)=O)[C@@H](OC(C)=O)[C@H]1OC(C)=O)S(=O)(=O)Cc1cn(nn1)-c1ccc(cc1)S(N)(=O)=O
: