Target
Carbonic anhydrase 1
Ligand
BDBM50354403
Substrate
Meas. Tech.
ChEMBL_770696 (CHEMBL1839821)
Ki
76±n/a nM
Citation
 Knaus, EEInnocenti, AScozzafava, ASupuran, CT Phenylethynylbenzenesulfonamide regioisomers strongly and selectively inhibit the transmembrane, tumor-associated carbonic anhydrase isoforms IX and XII over the cytosolic isoforms I and II. Bioorg Med Chem Lett 21:5892-6 (2011)  
Target
Name:
Carbonic anhydrase 1
Synonyms:
CA-I CAB Carbonate dehydratase I Carbonic anhydrase 1 (CA I) Carbonic anhydrase 1 (Recombinant CA I) Carbonic anhydrase B Carbonic anhydrase I (CA I) Carbonic anhydrase I (CAI) Carbonic anhydrase isoenzyme I (hCA I) | hCA
Type:
Enzyme
Mol. Mass.:
28873.37
Organism:
Homo sapiens (Human)
Description:
P00915
Residue:
261
  
Inhibitor
Name:
BDBM50354403
Synonyms:
CHEMBL1836406
Type:
Small organic molecule
Emp. Form.:
C15H13NO3S
Mol. Mass.:
287.334
SMILES:
COc1cccc(c1)C#Cc1cccc(c1)S(N)(=O)=O
: