Target
Carbonic anhydrase 9
Ligand
BDBM50354397
Substrate
Meas. Tech.
ChEMBL_770698 (CHEMBL1839823)
Ki
68±n/a nM
Citation
 Knaus, EEInnocenti, AScozzafava, ASupuran, CT Phenylethynylbenzenesulfonamide regioisomers strongly and selectively inhibit the transmembrane, tumor-associated carbonic anhydrase isoforms IX and XII over the cytosolic isoforms I and II. Bioorg Med Chem Lett 21:5892-6 (2011)  
Target
Name:
Carbonic anhydrase 9
Synonyms:
CA-IX CAH9_HUMAN Carbonic anhydrase 9 (CA IX) Carbonic anhydrase 9 precursor Carbonic anhydrase IX (CAIX) Carbonic anhydrases; II & IX MN RCC-associated antigen G250
Type:
Enzyme
Mol. Mass.:
49669.03
Organism:
Homo sapiens (Human)
Description:
Catalytic domain of human cloned isozyme was used in the assay
Residue:
459
  
Inhibitor
Name:
BDBM50354397
Synonyms:
CHEMBL1836400
Type:
Small organic molecule
Emp. Form.:
C15H13NO2S
Mol. Mass.:
271.334
SMILES:
Cc1ccc(cc1)C#Cc1ccc(cc1)S(N)(=O)=O
: