Target
Melanocyte-stimulating hormone receptor
Ligand
BDBM50354715
Substrate
Meas. Tech.
ChEMBL_771453 (CHEMBL1837213)
IC50
0.820000±n/a nM
Citation
 Baumhover, NJMartin, MEParameswarappa, SGKloepping, KCO'Dorisio, MSPigge, FCSchultz, MK Improved synthesis and biological evaluation of chelator-modifieda-MSH analogs prepared by copper-free click chemistry. Bioorg Med Chem Lett 21:5757-61 (2011)  
Target
Name:
Melanocyte-stimulating hormone receptor
Synonyms:
MC1-R Mc1r Melanocyte-stimulating hormone receptor | Msh-r
Type:
PROTEIN
Mol. Mass.:
35238.60
Organism:
Mus musculus
Description:
ChEMBL_1498846
Residue:
315
  
Inhibitor
Name:
BDBM50354715
Synonyms:
CHEMBL1834395
Type:
Small organic molecule
Emp. Form.:
C107H160FN29O24
Mol. Mass.:
2255.5936
SMILES:
CCCC[C@H](NC(=O)[C@H](CO)NC(=O)[C@H](Cc1ccc(O)cc1)NC(=O)[C@H](CO)NCCCCCCn1nnc2c1CCCCCC2(F)C(=O)NCCCCNC(=O)CN1CCN(CC(O)=O)CCN(CC(O)=O)CC1)C(=O)N[C@@H](CCC(O)=O)C(=O)N[C@@H](Cc1cnc[nH]1)C(=O)N[C@H](Cc1ccccc1)C(=O)N[C@@H](CCCN=C(N)N)C(=O)N[C@@H](Cc1c[nH]c2ccccc12)C(=O)NCC(=O)N[C@@H](CCCCN)C(=O)N1CCC[C@H]1C(=O)N[C@@H](C(C)C)C(N)=O
: