Target
Glucocorticoid receptor
Ligand
BDBM50354855
Substrate
Meas. Tech.
ChEMBL_772356 (CHEMBL1838801)
EC50
0.71±n/a nM
Citation
 Millan, DSBallard, SAChunn, SDybowski, JAFulton, CKGlossop, PAGuillabert, EHewson, CAJones, RMLamb, DJNapier, CMPayne-Cook, TARenery, ERSelby, MDTutt, MFYeadon, M Design and synthesis of long acting inhaled corticosteroids for the treatment of asthma. Bioorg Med Chem Lett 21:5826-30 (2011)  
Target
Name:
Glucocorticoid receptor
Synonyms:
GCR_HUMAN GRL Glucocorticoid receptor (GRFP) Nuclear receptor subfamily 3 group C member 1
Type:
Enzyme
Mol. Mass.:
85656.87
Organism:
Homo sapiens (Human)
Description:
P04150
Residue:
777
  
Inhibitor
Name:
BDBM50354855
Synonyms:
CHEMBL1834536
Type:
Small organic molecule
Emp. Form.:
C33H39F2NO7
Mol. Mass.:
599.6621
SMILES:
C[C@]12C[C@H](O)[C@@]3(F)[C@@H](C[C@H](F)C4=CC(=O)C=C[C@]34C)[C@@H]1C[C@H]1O[C@H](O[C@@]21C(=O)CO)c1ccc(CN2CCOCC2)cc1
: