Target
Corticotropin-releasing factor receptor 1
Ligand
BDBM50354972
Substrate
Meas. Tech.
ChEMBL_772056 (CHEMBL1837665)
Ki
867±n/a nM
Citation
 Miller, DCKlute, WBrown, AD Discovery of potent, metabolically stable purine CRF-1 antagonists with differentiated binding kinetic profiles. Bioorg Med Chem Lett 21:6108-11 (2011)  
Target
Name:
Corticotropin-releasing factor receptor 1
Synonyms:
CRF-R CRF1 CRFR1 CRH-R 1 CRHR1 Corticotropin-releasing factor receptor 1 (CRF-1) Corticotropin-releasing hormone receptor 1
Type:
Enzyme
Mol. Mass.:
50744.31
Organism:
Homo sapiens (Human)
Description:
P34998
Residue:
444
  
Inhibitor
Name:
BDBM50354972
Synonyms:
CHEMBL1836937
Type:
Small organic molecule
Emp. Form.:
C24H29N5O2
Mol. Mass.:
419.5194
SMILES:
COc1ccc(cc1)-n1c(nc2c(NC(C3CC3)C3CC3)nc(C)nc12)C1CCCO1
: