Target
Corticotropin-releasing factor receptor 1
Ligand
BDBM50354976
Substrate
Meas. Tech.
ChEMBL_772056 (CHEMBL1837665)
Ki
11±n/a nM
Citation
 Miller, DCKlute, WBrown, AD Discovery of potent, metabolically stable purine CRF-1 antagonists with differentiated binding kinetic profiles. Bioorg Med Chem Lett 21:6108-11 (2011)  
Target
Name:
Corticotropin-releasing factor receptor 1
Synonyms:
CRF-R CRF1 CRFR1 CRH-R 1 CRHR1 Corticotropin-releasing factor receptor 1 (CRF-1) Corticotropin-releasing hormone receptor 1
Type:
Enzyme
Mol. Mass.:
50744.31
Organism:
Homo sapiens (Human)
Description:
P34998
Residue:
444
  
Inhibitor
Name:
BDBM50354976
Synonyms:
CHEMBL1836940
Type:
Small organic molecule
Emp. Form.:
C20H22ClN5
Mol. Mass.:
367.875
SMILES:
Cc1nc2c(NC(C3CC3)C3CC3)nc(C)nc2n1-c1ccc(Cl)cc1
: