Target
Corticotropin-releasing factor receptor 1
Ligand
BDBM50116105
Substrate
Meas. Tech.
ChEMBL_772056 (CHEMBL1837665)
Ki
12±n/a nM
Citation
 Miller, DCKlute, WBrown, AD Discovery of potent, metabolically stable purine CRF-1 antagonists with differentiated binding kinetic profiles. Bioorg Med Chem Lett 21:6108-11 (2011)  
Target
Name:
Corticotropin-releasing factor receptor 1
Synonyms:
CRF-R CRF1 CRFR1 CRH-R 1 CRHR1 Corticotropin-releasing factor receptor 1 (CRF-1) Corticotropin-releasing hormone receptor 1
Type:
Enzyme
Mol. Mass.:
50744.31
Organism:
Homo sapiens (Human)
Description:
P34998
Residue:
444
  
Inhibitor
Name:
BDBM50116105
Synonyms:
3-(6-(dimethylamino)-4-methylpyridin-3-yl)-2,5-dimethyl-N,N-dipropylpyrazolo[1,5-a]pyrimidin-7-amine R-121919 [3-(6-Dimethylamino-4-methyl-pyridin-3-yl)-2,5-dimethyl-pyrazolo[1,5-a]pyrimidin-7-yl]-dipropyl-amine
Type:
Small organic molecule
Emp. Form.:
C22H32N6
Mol. Mass.:
380.5297
SMILES:
CCCN(CCC)c1cc(C)nc2c(c(C)nn12)-c1cnc(cc1C)N(C)C
: