Target
Prostaglandin G/H synthase 1
Ligand
BDBM50355034
Substrate
Meas. Tech.
ChEMBL_772485 (CHEMBL1839276)
IC50
>100000±n/a nM
Citation
 Abdur Rahim, MPraveen Rao, PNBhardwaj, AKaur, JHuang, ZKnaus, EE Isomeric acetoxy analogs of celecoxib and their evaluation as cyclooxygenase inhibitors. Bioorg Med Chem Lett 21:6074-80 (2011)  
Target
Name:
Prostaglandin G/H synthase 1
Synonyms:
COX1 Cyclooxygenase-1 (COX-1) PTGS1 | Prostaglandin G/H synthase (cyclooxygenase)
Type:
Protein
Mol. Mass.:
68868.60
Organism:
Ovis aries (Sheep)
Description:
Residue:
600
  
Inhibitor
Name:
BDBM50355034
Synonyms:
CHEMBL1835483
Type:
Small organic molecule
Emp. Form.:
C19H14F4N2O4S
Mol. Mass.:
442.384
SMILES:
CC(=O)Oc1cc(F)ccc1-c1cc(nn1-c1ccc(cc1)S(C)(=O)=O)C(F)(F)F
: