Target
Prostaglandin G/H synthase 1
Ligand
BDBM50355035
Substrate
Meas. Tech.
ChEMBL_772485 (CHEMBL1839276)
IC50
36000±n/a nM
Citation
 Abdur Rahim, MPraveen Rao, PNBhardwaj, AKaur, JHuang, ZKnaus, EE Isomeric acetoxy analogs of celecoxib and their evaluation as cyclooxygenase inhibitors. Bioorg Med Chem Lett 21:6074-80 (2011)  
Target
Name:
Prostaglandin G/H synthase 1
Synonyms:
COX1 Cyclooxygenase-1 (COX-1) PTGS1 | Prostaglandin G/H synthase (cyclooxygenase)
Type:
Protein
Mol. Mass.:
68868.60
Organism:
Ovis aries (Sheep)
Description:
Residue:
600
  
Inhibitor
Name:
BDBM50355035
Synonyms:
CHEMBL1835473
Type:
Small organic molecule
Emp. Form.:
C17H14F3N3O3S
Mol. Mass.:
397.372
SMILES:
Cc1ccc(-c2cc(nn2-c2ccc(cc2)S(N)(=O)=O)C(F)(F)F)c(O)c1
: