Target
Kallikrein-5 [D153N]
Ligand
BDBM50355088
Substrate
Meas. Tech.
ChEMBL_772791 (CHEMBL1837530)
Ki
22900±n/a nM
Citation
 Teixeira, TSFreitas, RFAbrahão, ODevienne, KFde Souza, LRBlaber, SIBlaber, MKondo, MYJuliano, MAJuliano, LPuzer, L Biological evaluation and docking studies of natural isocoumarins as inhibitors for human kallikrein 5 and 7. Bioorg Med Chem Lett 21:6112-5 (2011)  
Target
Name:
Kallikrein-5 [D153N]
Synonyms:
KLK-L2 KLK5_HUMAN Kallikrein-5 SCTE | Stratum corneum tryptic enzyme
Type:
PROTEIN
Mol. Mass.:
32031.75
Organism:
Homo sapiens (Human)
Description:
ChEMBL_1282456
Residue:
293
  
Inhibitor
Name:
BDBM50355088
Synonyms:
CHEMBL1834754
Type:
Small organic molecule
Emp. Form.:
C30H26O10
Mol. Mass.:
546.5214
SMILES:
COc1cc2cc3C[C@@H](C)OC(=O)c3c(O)c2c(O)c1-c1c(OC)cc2cc3C[C@@H](C)OC(=O)c3c(O)c2c1O
: