Target
Kallikrein-7
Ligand
BDBM50355088
Substrate
Meas. Tech.
ChEMBL_772792 (CHEMBL1837531)
IC50
135300±n/a nM
Citation
 Teixeira, TSFreitas, RFAbrahão, ODevienne, KFde Souza, LRBlaber, SIBlaber, MKondo, MYJuliano, MAJuliano, LPuzer, L Biological evaluation and docking studies of natural isocoumarins as inhibitors for human kallikrein 5 and 7. Bioorg Med Chem Lett 21:6112-5 (2011)  
Target
Name:
Kallikrein-7
Synonyms:
KLK7 Kallikrein 7 PRSS6 Serine protease 6 hK7 kallikrein-7 isoform 1 preproprotein
Type:
PROTEIN
Mol. Mass.:
27535.05
Organism:
Homo sapiens (Human)
Description:
ChEMBL_1469257
Residue:
253
  
Inhibitor
Name:
BDBM50355088
Synonyms:
CHEMBL1834754
Type:
Small organic molecule
Emp. Form.:
C30H26O10
Mol. Mass.:
546.5214
SMILES:
COc1cc2cc3C[C@@H](C)OC(=O)c3c(O)c2c(O)c1-c1c(OC)cc2cc3C[C@@H](C)OC(=O)c3c(O)c2c1O
: