Target
Adenosine receptor A3
Ligand
BDBM50355155
Substrate
Meas. Tech.
ChEMBL_772802 (CHEMBL1837541)
Ki
2.1±n/a nM
Citation
 Cheong, SLDolzhenko, AVPaoletta, SLee, EPKachler, SFederico, SKlotz, KNDolzhenko, AVSpalluto, GMoro, SPastorin, G Does the combination of optimal substitutions at the C²-, N¿?¿- and N¿?¿-positions of the pyrazolo-triazolo-pyrimidine scaffold guarantee selective modulation of the human A3 adenosine receptors? Bioorg Med Chem 19:6120-34 (2011)  
Target
Name:
Adenosine receptor A3
Synonyms:
A3 adenosine receptor (hA3) ADORA3 | Adenosine A3 receptor (A3AR)
Type:
G Protein-Coupled Receptor (GPCR)
Mol. Mass.:
36197.32
Organism:
Homo sapiens (Human)
Description:
P0DMS8
Residue:
318
  
Inhibitor
Name:
BDBM50355155
Synonyms:
CHEMBL1834696
Type:
Small organic molecule
Emp. Form.:
C27H22N8O2
Mol. Mass.:
490.516
SMILES:
COc1ccc(NC(=O)Nc2nc3nn(C)cc3c3nc(nn23)-c2ccc(cc2)-c2ccccc2)cc1
: