Target
Acetylcholinesterase
Ligand
BDBM8961
Substrate
Meas. Tech.
ChEMBL_773728 (CHEMBL1840094)
IC50
50±n/a nM
Citation
 Liu, JDumontet, VSimonin, ALIorga, BIGuerineau, VLitaudon, MNguyen, VHGueritte, F Benzofurans from Styrax agrestis as acetylcholinesterase inhibitors: structure-activity relationships and molecular modeling studies. J Nat Prod 74:2081-8 (2011)  
Target
Name:
Acetylcholinesterase
Synonyms:
ACES_ELEEL Acetylcholinesterase (EeAChE) | ache
Type:
Enzyme
Mol. Mass.:
71812.79
Organism:
Electrophorus electricus (Electric eel)
Description:
Residue:
633
  
Inhibitor
Name:
BDBM8961
Synonyms:
1,2,3,4-tetrahydro-9-acridinamine 9-THA CHEMBL1337960 Cognex Tracine cid_1935 | tacrine.HCl
Type:
Small organic molecule
Emp. Form.:
C13H14N2
Mol. Mass.:
198.2637
SMILES:
Nc1c2CCCCc2nc2ccccc12
: