Target
Mast/stem cell growth factor receptor Kit
Ligand
BDBM50355486
Substrate
Meas. Tech.
ChEMBL_773457 (CHEMBL1840409)
Ki
10±n/a nM
Citation
 Davies, RJPierce, ACForster, CGrey, RXu, JArnost, MChoquette, DGalullo, VTian, SKHenkel, GChen, GHeidary, DKMa, JStuver-Moody, CNamchuk, M Design, synthesis, and evaluation of a novel dual FMS-like tyrosine kinase 3/stem cell factor receptor (FLT3/c-KIT) inhibitor for the treatment of acute myelogenous leukemia. J Med Chem 54:7184-92 (2011)  
Target
Name:
Mast/stem cell growth factor receptor Kit
Synonyms:
CD117 antigen KIT Mast/stem cell growth factor receptor Kit (cKIT) Proto-oncogene tyrosine-protein kinase Kit Stem cell growth factor receptor Tyrosine-protein kinase Kit c-kit v-kit Hardy-Zuckerman 4 feline sarcoma viral oncogene homolog
Type:
Protein
Mol. Mass.:
109869.37
Organism:
Homo sapiens (Human)
Description:
P10721
Residue:
976
  
Inhibitor
Name:
BDBM50355486
Synonyms:
CHEMBL1835864
Type:
Small organic molecule
Emp. Form.:
C18H19N7O2
Mol. Mass.:
365.3892
SMILES:
Nc1nc(Nc2cccc(c2)C(=O)N2CCOCC2)nn1-c1ccccn1
: